BDBM50021228 1-(3,4-Dichloro-phenyl)-3-dimethylamino-indan-5-ol::CHEMBL53635
SMILES CN(C)C1CC(c2ccc(O)cc12)c1ccc(Cl)c(Cl)c1
InChI Key InChIKey=VTUWUYTVHRWRGM-UHFFFAOYSA-N
Data  3 IC50
  Tab Delimited (TSV)   2D SDfile   Computed 3D by Vconf -m prep SDfile
Find this compound or compounds like it in BindingDB:
Activity Spreadsheet -- Enzyme Inhibition Constant Data from BindingDB
Found 3 hits for monomerid = 50021228
TargetSodium-dependent serotonin transporter(Rattus norvegicus (rat))
TBA
Curated by ChEMBL
LigandPNGBDBM50021228(1-(3,4-Dichloro-phenyl)-3-dimethylamino-indan-5-ol...)
Affinity DataIC50:  0.370nM. Assay description: Inhibition of 5-HT uptake in rat synaptosomal fraction
In DepthDetails ArticlePubMed
TargetTransporter(Rattus norvegicus)
TBA
Curated by ChEMBL
LigandPNGBDBM50021228(1-(3,4-Dichloro-phenyl)-3-dimethylamino-indan-5-ol...)
Affinity DataIC50:  16nM. Assay description: Inhibition of noradrenaline uptake in rat synaptosomal fraction
In DepthDetails ArticlePubMed
TargetSodium-dependent dopamine transporter(Rattus norvegicus (rat))
TBA
Curated by ChEMBL
LigandPNGBDBM50021228(1-(3,4-Dichloro-phenyl)-3-dimethylamino-indan-5-ol...)
Affinity DataIC50:  7.90nM. Assay description: Inhibition of dopamine uptake in rat synaptosomal fraction
In DepthDetails ArticlePubMed