BDBM50021247 CHEMBL300069::[3-(4-Bromo-phenyl)-indan-1-yl]-dimethyl-amine
SMILES CN(C)C1CC(c2ccccc12)c1ccc(Br)cc1
InChI Key InChIKey=FAVRAXVBHORDCR-UHFFFAOYSA-N
Data  6 IC50
  Tab Delimited (TSV)   2D SDfile   Computed 3D by Vconf -m prep SDfile
Find this compound or compounds like it in BindingDB:
Activity Spreadsheet -- Enzyme Inhibition Constant Data from BindingDB
Found 6 hits for monomerid = 50021247
TargetTransporter(Rattus norvegicus)
TBA
Curated by ChEMBL
LigandPNGBDBM50021247(CHEMBL300069 | [3-(4-Bromo-phenyl)-indan-1-yl]-dim...)
Affinity DataIC50:  4.30nM. Assay description: Inhibition of noradrenaline uptake in rat synaptosomal fraction
In DepthDetails ArticlePubMed
TargetSodium-dependent dopamine transporter(Rattus norvegicus (rat))
TBA
Curated by ChEMBL
LigandPNGBDBM50021247(CHEMBL300069 | [3-(4-Bromo-phenyl)-indan-1-yl]-dim...)
Affinity DataIC50:  83nM. Assay description: Inhibition of dopamine uptake in rat synaptosomal fraction
In DepthDetails ArticlePubMed
TargetTransporter(Rattus norvegicus)
TBA
Curated by ChEMBL
LigandPNGBDBM50021247(CHEMBL300069 | [3-(4-Bromo-phenyl)-indan-1-yl]-dim...)
Affinity DataIC50:  4.30nM. Assay description: Inhibition of noradrenaline uptake in rat synaptosomal fraction
In DepthDetails ArticlePubMed
TargetSodium-dependent serotonin transporter(Rattus norvegicus (rat))
TBA
Curated by ChEMBL
LigandPNGBDBM50021247(CHEMBL300069 | [3-(4-Bromo-phenyl)-indan-1-yl]-dim...)
Affinity DataIC50:  0.140nM. Assay description: Inhibition of 5-HT uptake in rat synaptosomal fraction
In DepthDetails ArticlePubMed
TargetSodium-dependent dopamine transporter(Rattus norvegicus (rat))
TBA
Curated by ChEMBL
LigandPNGBDBM50021247(CHEMBL300069 | [3-(4-Bromo-phenyl)-indan-1-yl]-dim...)
Affinity DataIC50:  83nM. Assay description: Inhibition of dopamine uptake in rat synaptosomal fraction
In DepthDetails ArticlePubMed
TargetSodium-dependent serotonin transporter(Rattus norvegicus (rat))
TBA
Curated by ChEMBL
LigandPNGBDBM50021247(CHEMBL300069 | [3-(4-Bromo-phenyl)-indan-1-yl]-dim...)
Affinity DataIC50:  0.140nM. Assay description: Inhibition of 5-HT uptake in rat synaptosomal fraction
In DepthDetails ArticlePubMed