BDBM50021420 3,4-Dimethoxy-benzoic acid 1-methyl-piperidin-4-yl ester::CHEMBL284162
SMILES COc1ccc(cc1OC)C(=O)OC1CCN(C)CC1
InChI Key InChIKey=UWQSSCODGAHWKH-UHFFFAOYSA-N
Data  1 IC50
  Tab Delimited (TSV)   2D SDfile   Computed 3D by Vconf -m prep SDfile
Find this compound or compounds like it in BindingDB:
Activity Spreadsheet -- Enzyme Inhibition Constant Data from BindingDB
Found 1 hit for monomerid = 50021420
TargetSodium channel protein type 1/2/3 subunit alpha(Homo sapiens (Human))
TBA
Curated by ChEMBL
LigandPNGBDBM50021420(3,4-Dimethoxy-benzoic acid 1-methyl-piperidin-4-yl...)
Affinity DataIC50: >1.00E+4nM. Assay description: Inhibition of [3H]-BTX binding to guinea pig voltage-dependent sodium channel
In DepthDetails ArticlePubMed