BDBM50021427 Biphenyl-2-carboxylic acid 2-diethylamino-1-methyl-ethyl ester::CHEMBL34070
SMILES CCN(CC)CC(C)OC(=O)c1ccccc1-c1ccccc1
InChI Key InChIKey=FHJSTVICNXFDNP-UHFFFAOYSA-N
Data  1 IC50
  Tab Delimited (TSV)   2D SDfile   Computed 3D by Vconf -m prep SDfile
Find this compound or compounds like it in BindingDB:
Activity Spreadsheet -- Enzyme Inhibition Constant Data from BindingDB
Found 1 hit for monomerid = 50021427
TargetSodium channel protein type 1/2/3 subunit alpha(Homo sapiens (Human))
TBA
Curated by ChEMBL
LigandPNGBDBM50021427(Biphenyl-2-carboxylic acid 2-diethylamino-1-methyl...)
Affinity DataIC50:  6.80E+3nM. Assay description: Inhibition of [3H]-BTX binding to guinea pig voltage-dependent sodium channel
In DepthDetails ArticlePubMed