BDBM50021429 CHEMBL39512::Propionic acid 1-methyl-piperidin-4-yl ester
SMILES CCC(=O)OC1CCN(C)CC1
InChI Key InChIKey=OVQSLAXVKJVHJO-UHFFFAOYSA-N
Data  1 IC50
  Tab Delimited (TSV)   2D SDfile   Computed 3D by Vconf -m prep SDfile
Find this compound or compounds like it in BindingDB:
Activity Spreadsheet -- Enzyme Inhibition Constant Data from BindingDB
Found 1 hit for monomerid = 50021429
TargetSodium channel protein type 1/2/3 subunit alpha(Homo sapiens (Human))
TBA
Curated by ChEMBL
LigandPNGBDBM50021429(CHEMBL39512 | Propionic acid 1-methyl-piperidin-4-...)
Affinity DataIC50: >1.00E+4nM. Assay description: Inhibition of [3H]-BTX binding to guinea pig voltage-dependent sodium channel
In DepthDetails ArticlePubMed