BDBM50021433 Adamantane-1-carboxylic acid 1,4-dimethyl-piperidin-4-yl ester::CHEMBL40617
SMILES CN1CCC(C)(CC1)OC(=O)C12C[C@H]3C[C@H](C[C@H](C3)C1)C2
InChI Key InChIKey=QSTIZOOMOQLRAV-FFRXJBQQSA-N
Data  1 IC50
  Tab Delimited (TSV)   2D SDfile   Computed 3D by Vconf -m prep SDfile
Find this compound or compounds like it in BindingDB:
Activity Spreadsheet -- Enzyme Inhibition Constant Data from BindingDB
Found 1 hit for monomerid = 50021433
TargetSodium channel protein type 1/2/3 subunit alpha(Homo sapiens (Human))
TBA
Curated by ChEMBL
LigandPNGBDBM50021433(Adamantane-1-carboxylic acid 1,4-dimethyl-piperidi...)
Affinity DataIC50:  1.15E+4nM. Assay description: Inhibition of [3H]-BTX binding to guinea pig voltage-dependent sodium channel
In DepthDetails ArticlePubMed