BDBM50022838 Ac-Pro-Phe-His-Sta-NH2::CHEMBL316614
SMILES CC(C)CC(NC(=O)[C@H](Cc1cnc[nH]1)NC(=O)[C@H](Cc1ccccc1)NC(=O)[C@@H]1CCCN1C=O)C(O)CC(N)=O
InChI Key InChIKey=SCXHBTGREGDHHQ-VDYHLHOTSA-N
Data  1 IC50
  Tab Delimited (TSV)   2D SDfile   Computed 3D by Vconf -m prep SDfile
Find this compound or compounds like it in BindingDB:
Activity Spreadsheet -- Enzyme Inhibition Constant Data from BindingDB
Found 1 hit for monomerid = 50022838
TargetRenin(Homo sapiens (Human))
Upjohn
Curated by ChEMBL
LigandPNGBDBM50022838(Ac-Pro-Phe-His-Sta-NH2 | CHEMBL316614)
Affinity DataIC50:  5.80E+3nM. Assay description: In vitro inhibitory activity against human plasma renin
In DepthDetails ArticlePubMed