BDBM50022852 Ac-Ftr-Gly-Phe-His-Phe-Phe-Val-Ftr-NH2::CHEMBL437516
SMILES CC(C)[C@H](NC(=O)[C@H](Cc1ccccc1)NC(=O)[C@H](Cc1ccccc1)NC(=O)[C@H](Cc1cnc[nH]1)NC(=O)[C@H](Cc1ccccc1)NC(=O)CNC(=O)[C@H](Cc1cn(C=O)c2ccccc12)NC(C)=O)C(=O)N[C@@H](Cc1cn(C=O)c2ccccc12)C(N)=O
InChI Key InChIKey=FMQAJDXQPHSPMN-ZXQBWHKPSA-N
Data  1 IC50
  Tab Delimited (TSV)   2D SDfile   Computed 3D by Vconf -m prep SDfile
Find this compound or compounds like it in BindingDB:
Activity Spreadsheet -- Enzyme Inhibition Constant Data from BindingDB
Found 1 hit for monomerid = 50022852
TargetRenin(Homo sapiens (Human))
Upjohn
Curated by ChEMBL
LigandPNGBDBM50022852(Ac-Ftr-Gly-Phe-His-Phe-Phe-Val-Ftr-NH2 | CHEMBL437...)
Affinity DataIC50: >1.00E+5nM. Assay description: In vitro inhibitory activity against human plasma renin
In DepthDetails ArticlePubMed