BDBM50022855 Ac-Ftr-Pro-Phe-His-Phe-Phe-Val-Ftr-NH2::CHEMBL263739
SMILES CC(C)[C@H](NC(=O)[C@H](Cc1ccccc1)NC(=O)[C@H](Cc1ccccc1)NC(=O)[C@H](Cc1cnc[nH]1)NC(=O)[C@H](Cc1ccccc1)NC(=O)[C@@H]1CCCN1C(=O)[C@H](Cc1cn(C=O)c2ccccc12)NC(C)=O)C(=O)N[C@@H](Cc1cn(C=O)c2ccccc12)C(N)=O
InChI Key InChIKey=ZOIKWQQWTLRTQH-MTVYKSGESA-N
Data  1 IC50
  Tab Delimited (TSV)   2D SDfile   Computed 3D by Vconf -m prep SDfile
Find this compound or compounds like it in BindingDB:
Activity Spreadsheet -- Enzyme Inhibition Constant Data from BindingDB
Found 1 hit for monomerid = 50022855
TargetRenin(Homo sapiens (Human))
Upjohn
Curated by ChEMBL
LigandPNGBDBM50022855(Ac-Ftr-Pro-Phe-His-Phe-Phe-Val-Ftr-NH2 | CHEMBL263...)
Affinity DataIC50:  500nM. Assay description: In vitro inhibitory activity against human plasma renin
In DepthDetails ArticlePubMed