BDBM50022860 Ac-D-Ftr-Pro-Phe-His-Sta-Ile-NH2::CHEMBL330412
SMILES CC[C@H](C)[C@H](NC(=O)CC(O)[C@H](CC(C)C)NC(=O)[C@H](Cc1cnc[nH]1)NC(=O)[C@H](Cc1ccccc1)NC(=O)[C@@H]1CCCN1C(=O)[C@@H](Cc1cn(C=O)c2ccccc12)NC(C)=O)C(N)=O
InChI Key InChIKey=MVKIAKQYOLSMAX-IBJOAXOFSA-N
Data  1 IC50
  Tab Delimited (TSV)   2D SDfile   Computed 3D by Vconf -m prep SDfile
Find this compound or compounds like it in BindingDB:
Activity Spreadsheet -- Enzyme Inhibition Constant Data from BindingDB
Found 1 hit for monomerid = 50022860
TargetRenin(Homo sapiens (Human))
Upjohn
Curated by ChEMBL
LigandPNGBDBM50022860(Ac-D-Ftr-Pro-Phe-His-Sta-Ile-NH2 | CHEMBL330412)
Affinity DataIC50:  14nM. Assay description: In vitro inhibitory activity against human plasma renin
In DepthDetails ArticlePubMed