BDBM50022940 CHEMBL3298373
SMILES CC1(C)CCc2c(C1)[nH]nc2C(=O)Nc1cnn(c1)[C@@H](C1CCNCC1)c1ccccc1
InChI Key InChIKey=ILYQIAVPXLQYSF-HSZRJFAPSA-N
Data  2 KI  1 IC50
  Tab Delimited (TSV)   2D SDfile   Computed 3D by Vconf -m prep SDfile
Find this compound or compounds like it in BindingDB:
Activity Spreadsheet -- Enzyme Inhibition Constant Data from BindingDB
Found 2 hits for monomerid = 50022940
TargetTyrosine-protein kinase ITK/TSK(Homo sapiens (Human))
Genentech
Curated by ChEMBL
LigandPNGBDBM50022940(CHEMBL3298373)
Affinity DataKi:  0.200nM. Assay description: Inhibition of GST-tagged full length ITK (unknown origin) using BLK peptide as substrate after 35 mins
In DepthDetails ArticlePubMed
TargetAurora kinase A(Homo sapiens (Human))
Genentech
Curated by ChEMBL
LigandPNGBDBM50022940(CHEMBL3298373)
Affinity DataKi:  19nM. Assay description: Inhibition of human His-tagged full length AURKA using kemptide peptide as substrate after 60 mins
In DepthDetails ArticlePubMed