BDBM50023017 CHEMBL41231::ethyl 4-[2-(4-ethyloxycarbonylbenzyloxy)-1-(1H-1-imidazolylmethyl)ethoxymethyl]benzoate
SMILES CCOC(=O)c1ccc(COCC(Cn2ccnc2)OCc2ccc(cc2)C(=O)OCC)cc1
InChI Key InChIKey=VCSHSSAIOFVZTH-UHFFFAOYSA-N
Data  1 IC50
  Tab Delimited (TSV)   2D SDfile   Computed 3D by Vconf -m prep SDfile
Find this compound or compounds like it in BindingDB:
Activity Spreadsheet -- Enzyme Inhibition Constant Data from BindingDB
Found 1 hit for monomerid = 50023017
TargetThromboxane-A synthase(Homo sapiens (Human))
TBA
Curated by ChEMBL
LigandPNGBDBM50023017(CHEMBL41231 | ethyl 4-[2-(4-ethyloxycarbonylbenzyl...)
Affinity DataIC50:  700nM. Assay description: Tested for inhibitory activity against intact human platelet TXA2 formation
In DepthDetails ArticlePubMed