BDBM50023026 CHEMBL3144107::{1-[1-{1-[1-Hydroxy-2-(2-methyl-propane-1-sulfonyl)-ethyl]-3-methyl-butylcarbamoyl}-2-(1H-imidazol-4-yl)-ethylcarbamoyl]-2-phenyl-ethyl}-carbamic acid tert-butyl ester
SMILES CC(C)C[C@@H](NC(=O)[C@H](Cc1c[nH]cn1)NC(=O)[C@H](Cc1ccccc1)NC(=O)OC(C)(C)C)[C@H](O)CS(=O)(=O)CC(C)C
InChI Key InChIKey=GGJQHHDYMXXKAP-JGYHXSOQSA-N
Data  1 IC50
  Tab Delimited (TSV)   2D SDfile   Computed 3D by Vconf -m prep SDfile
Find this compound or compounds like it in BindingDB:
Activity Spreadsheet -- Enzyme Inhibition Constant Data from BindingDB
Found 1 hit for monomerid = 50023026
TargetRenin(Homo sapiens (Human))
TBA
Curated by ChEMBL
LigandPNGBDBM50023026(CHEMBL3144107 | {1-[1-{1-[1-Hydroxy-2-(2-methyl-pr...)
Affinity DataIC50:  350nM. Assay description: The compound was tested for inhibition of human renal renin at the pH optimum 7.4
In DepthDetails ArticlePubMed