BDBM50024850 2-Benzyl-5-tert-butyl-7-methyl-1H-benzoimidazol-4-ol::CHEMBL309083
SMILES Cc1cc(c(O)c2[nH]c(Cc3ccccc3)nc12)C(C)(C)C
InChI Key InChIKey=APAGDABMBXHTAG-UHFFFAOYSA-N
Data  1 IC50
  Tab Delimited (TSV)   2D SDfile   Computed 3D by Vconf -m prep SDfile
Find this compound or compounds like it in BindingDB:
Activity Spreadsheet -- Enzyme Inhibition Constant Data from BindingDB
Found 1 hit for monomerid = 50024850
TargetPolyunsaturated fatty acid 5-lipoxygenase(Rattus norvegicus)
Beecham Pharmaceuticals Research Division
Curated by ChEMBL
LigandPNGBDBM50024850(2-Benzyl-5-tert-butyl-7-methyl-1H-benzoimidazol-4-...)
Affinity DataIC50:  1.30E+3nM. Assay description: In vitro inhibition of RBL-1 5-lipoxygenase; Value ranges from 1.1-1.6
In DepthDetails ArticlePubMed