BDBM50024851 7-Methyl-2-trifluoromethyl-1H-benzoimidazol-4-ol::CHEMBL302735
SMILES Cc1ccc(O)c2nc([nH]c12)C(F)(F)F
InChI Key InChIKey=YRWQTOPVGJBPLT-UHFFFAOYSA-N
Data  1 IC50
  Tab Delimited (TSV)   2D SDfile   Computed 3D by Vconf -m prep SDfile
Find this compound or compounds like it in BindingDB:
Activity Spreadsheet -- Enzyme Inhibition Constant Data from BindingDB
Found 1 hit for monomerid = 50024851
TargetPolyunsaturated fatty acid 5-lipoxygenase(Rattus norvegicus)
Beecham Pharmaceuticals Research Division
Curated by ChEMBL
LigandPNGBDBM50024851(7-Methyl-2-trifluoromethyl-1H-benzoimidazol-4-ol |...)
Affinity DataIC50:  250nM. Assay description: In vitro inhibition of RBL-1 5-lipoxygenase; Value ranges from 0.18-0.31
In DepthDetails ArticlePubMed