BDBM50025201 9-Aminomethyl-9H-fluorene-3,4-diol::CHEMBL55693
SMILES NCC1c2ccccc2-c2c1ccc(O)c2O
InChI Key InChIKey=YLOTUMWDVNOPBU-UHFFFAOYSA-N
Data  1 KI
  Tab Delimited (TSV)   2D SDfile   Computed 3D by Vconf -m prep SDfile
Find this compound or compounds like it in BindingDB:
Activity Spreadsheet -- Enzyme Inhibition Constant Data from BindingDB
Found 1 hit for monomerid = 50025201
TargetD(1A) dopamine receptor(RAT)
TBA
Curated by ChEMBL
LigandPNGBDBM50025201(9-Aminomethyl-9H-fluorene-3,4-diol | CHEMBL55693)
Affinity DataKi:  380nM. Assay description: Displacement of [3H]fenoldopam from Dopamine receptor D1 of rat striatum membranes
In DepthDetails ArticlePubMed