BDBM50025205 6-(2-Dipropylamino-ethyl)-biphenyl-2,3-diol::CHEMBL300995
SMILES CCCN(CCC)CCc1ccc(O)c(O)c1-c1ccccc1
InChI Key InChIKey=HDPTVXIDWCYRQU-UHFFFAOYSA-N
Data  1 KI
  Tab Delimited (TSV)   2D SDfile   Computed 3D by Vconf -m prep SDfile
Find this compound or compounds like it in BindingDB:
Activity Spreadsheet -- Enzyme Inhibition Constant Data from BindingDB
Found 1 hit for monomerid = 50025205
TargetD(1A) dopamine receptor(RAT)
TBA
Curated by ChEMBL
LigandPNGBDBM50025205(6-(2-Dipropylamino-ethyl)-biphenyl-2,3-diol | CHEM...)
Affinity DataKi:  1.94E+3nM. Assay description: Displacement of [3H]fenoldopam from Dopamine receptor D1 of rat striatum membranes
In DepthDetails ArticlePubMed