BDBM50025209 6-Chloro-9-(4-hydroxy-phenyl)-2,3,4,5-tetrahydro-1H-benzo[d]azepine-7,8-diol::CHEMBL292611
SMILES Oc1ccc(cc1)-c1c(O)c(O)c(Cl)c2CCNCCc12
InChI Key InChIKey=YXYDGLLKQJKPBQ-UHFFFAOYSA-N
Data  1 KI
  Tab Delimited (TSV)   2D SDfile   Computed 3D by Vconf -m prep SDfile
Find this compound or compounds like it in BindingDB:
Activity Spreadsheet -- Enzyme Inhibition Constant Data from BindingDB
Found 1 hit for monomerid = 50025209
TargetD(1A) dopamine receptor(RAT)
TBA
Curated by ChEMBL
LigandPNGBDBM50025209(6-Chloro-9-(4-hydroxy-phenyl)-2,3,4,5-tetrahydro-1...)
Affinity DataKi:  1.63E+3nM. Assay description: Displacement of [3H]fenoldopam from Dopamine receptor D1 of rat striatum membranes
In DepthDetails ArticlePubMed