BDBM50025877 CHEMBL58683::N-[1R-(2-phenyl ethyl)]propanamide difluoroborane
SMILES CC(N)C(=O)N[C@@H](Cc1ccccc1)B(F)F
InChI Key InChIKey=KPQISZKOTPKWCQ-HTLJXXAVSA-N
Data  1 KI
  Tab Delimited (TSV)   2D SDfile   Computed 3D by Vconf -m prep SDfile
Find this compound or compounds like it in BindingDB:
Activity Spreadsheet -- Enzyme Inhibition Constant Data from BindingDB
Found 1 hit for monomerid = 50025877
TargetChymotrypsinogen B(Homo sapiens (Human))
TBA
Curated by ChEMBL
LigandPNGBDBM50025877(CHEMBL58683 | N-[1R-(2-phenyl ethyl)]propanamide d...)
Affinity DataKi:  290nM. Assay description: Competetive inhibition of alpha-chymotrypsin
In DepthDetails ArticlePubMed