BDBM50025982 CHEMBL33874::N-[4-(2-Imidazol-1-yl-ethoxy)-benzoyl]-benzamide
SMILES O=C(NC(=O)c1ccc(OCCn2ccnc2)cc1)c1ccccc1
InChI Key InChIKey=LHIVTYKDYGIDHT-UHFFFAOYSA-N
Data  1 IC50
  Tab Delimited (TSV)   2D SDfile   Computed 3D by Vconf -m prep SDfile
Find this compound or compounds like it in BindingDB:
Activity Spreadsheet -- Enzyme Inhibition Constant Data from BindingDB
Found 1 hit for monomerid = 50025982
TargetThromboxane-A synthase(Homo sapiens (Human))
TBA
Curated by ChEMBL
LigandPNGBDBM50025982(CHEMBL33874 | N-[4-(2-Imidazol-1-yl-ethoxy)-benzoy...)
Affinity DataIC50:  180nM. Assay description: Inhibitory activity against thromboxane A2 synthetase
In DepthDetails ArticlePubMed