BDBM50026368 2-Amino-4-[1-(carboxymethyl-carbamoyl)-2-(3-nitro-benzyloxycarbonylsulfanyl)-ethylcarbamoyl]-butyric acid::CHEMBL355031
SMILES NC(CCC(=O)NC(CSC(=O)OCc1cccc(c1)[N+]([O-])=O)C(=O)NCC(O)=O)C(O)=O
InChI Key InChIKey=OLLNYAGAESAEGA-UHFFFAOYSA-N
Data  1 KI
  Tab Delimited (TSV)   2D SDfile   Computed 3D by Vconf -m prep SDfile
Find this compound or compounds like it in BindingDB:
Activity Spreadsheet -- Enzyme Inhibition Constant Data from BindingDB
Found 1 hit for monomerid = 50026368
TargetHydroxyacylglutathione hydrolase, mitochondrial(Rattus norvegicus)
TBA
Curated by ChEMBL
LigandPNGBDBM50026368(2-Amino-4-[1-(carboxymethyl-carbamoyl)-2-(3-nitro-...)
Affinity DataKi:  9.00E+3nM. Assay description: Binding affinity towards rat liver glyoxalase II
In DepthDetails ArticlePubMed