BDBM50026369 2-Amino-4-[2-benzyloxycarbonylsulfanyl-1-(carboxymethyl-carbamoyl)-ethylcarbamoyl]-butyric acid::CHEMBL169316
SMILES NC(CCC(=O)NC(CSC(=O)OCc1ccccc1)C(=O)NCC(O)=O)C(O)=O
InChI Key InChIKey=ASKLIFLGJJZFTM-UHFFFAOYSA-N
Data  1 KI
  Tab Delimited (TSV)   2D SDfile   Computed 3D by Vconf -m prep SDfile
Find this compound or compounds like it in BindingDB:
Activity Spreadsheet -- Enzyme Inhibition Constant Data from BindingDB
Found 1 hit for monomerid = 50026369
TargetHydroxyacylglutathione hydrolase, mitochondrial(Rattus norvegicus)
TBA
Curated by ChEMBL
LigandPNGBDBM50026369(2-Amino-4-[2-benzyloxycarbonylsulfanyl-1-(carboxym...)
Affinity DataKi:  6.50E+4nM. Assay description: Binding affinity towards rat liver glyoxalase II
In DepthDetails ArticlePubMed