BDBM50027767 CHEMBL246988
SMILES CCCOc1ccc(cc1-c1nc2c(CCC)nn(C)c2c(=O)[nH]1)S(=O)(=O)N1CCC(CC(O)=O)CC1
InChI Key InChIKey=MEKKLAMMHOJJHA-UHFFFAOYSA-N
Data  1 IC50
  Tab Delimited (TSV)   2D SDfile   Computed 3D by Vconf -m prep SDfile
Find this compound or compounds like it in BindingDB:
Activity Spreadsheet -- Enzyme Inhibition Constant Data from BindingDB
Found 1 hit for monomerid = 50027767
TargetcGMP-specific 3',5'-cyclic phosphodiesterase(Homo sapiens (Human))
Sungkyunkwan University
Curated by ChEMBL
LigandPNGBDBM50027767(CHEMBL246988)
Affinity DataIC50:  0.110nM. Assay description: Inhibition of PDE5
In DepthDetails ArticlePubMed