BDBM50028644 (+/-)2-Amino-3-phenyl-propan-1-ol::(R)2-Amino-3-phenyl-propan-1-ol::(S)2-Amino-3-phenyl-propan-1-ol::CHEMBL21676::Phenylalaninol2-Amino-3-phenyl-propan-1-ol
SMILES NC(CO)Cc1ccccc1
InChI Key InChIKey=STVVMTBJNDTZBF-UHFFFAOYSA-N
Data  1 KI
  Tab Delimited (TSV)   2D SDfile   Computed 3D by Vconf -m prep SDfile
Find this compound or compounds like it in BindingDB:
Activity Spreadsheet -- Enzyme Inhibition Constant Data from BindingDB
Found 1 hit for monomerid = 50028644
TargetPhenylethanolamine N-methyltransferase(Bos taurus (bovine))
TBA
Curated by ChEMBL
LigandPNGBDBM50028644((+/-)2-Amino-3-phenyl-propan-1-ol | (R)2-Amino-3-p...)
Affinity DataKi:  3.85E+5nM. Assay description: Inhibitory activity against bovine adrenal norepinephrine N-methyl-transferase was determined
In DepthDetails ArticlePubMed