BDBM50028648 2-Cyclohexyl-1-phenyl-ethylamine::CHEMBL22863
SMILES NC(CC1CCCCC1)c1ccccc1
InChI Key InChIKey=HFLQIMOFFSZGIH-UHFFFAOYSA-N
Data  1 KI
  Tab Delimited (TSV)   2D SDfile   Computed 3D by Vconf -m prep SDfile
Find this compound or compounds like it in BindingDB:
Activity Spreadsheet -- Enzyme Inhibition Constant Data from BindingDB
Found 1 hit for monomerid = 50028648
TargetPhenylethanolamine N-methyltransferase(Bos taurus (bovine))
TBA
Curated by ChEMBL
LigandPNGBDBM50028648(2-Cyclohexyl-1-phenyl-ethylamine | CHEMBL22863)
Affinity DataKi: >1.00E+6nM. Assay description: Inhibitory activity against bovine adrenal norepinephrine N-methyl-transferase was determined
In DepthDetails ArticlePubMed