BDBM50029262 Pentanoic acid {5-[4-(2-isopropoxy-phenyl)-piperazin-1-ylmethyl]-1-methyl-1H-pyrrol-2-ylmethyl}-methyl-amide;succinate
SMILES CCCCC(=O)N(C)Cc1ccc(CN2CCN(CC2)c2ccccc2OC(C)C)n1C
InChI Key InChIKey=IMUYDTCACMPZTB-UHFFFAOYSA-N
Data  2 KI
  Tab Delimited (TSV)   2D SDfile   Computed 3D by Vconf -m prep SDfile
Find this compound or compounds like it in BindingDB:
Activity Spreadsheet -- Enzyme Inhibition Constant Data from BindingDB
Found 2 hits for monomerid = 50029262
Target5-hydroxytryptamine receptor 1A(Rattus norvegicus (rat))
R. W. Johnson Pharmaceutical Research Institute
Curated by ChEMBL
LigandPNGBDBM50029262(Pentanoic acid {5-[4-(2-isopropoxy-phenyl)-piperaz...)
Affinity DataKi:  0.25nM. Assay description: Binding affinity was determined against 5-hydroxytryptamine 1A receptor using [3H]WB-4101
In DepthDetails ArticlePubMed
TargetD(2) dopamine receptor(Rattus norvegicus (rat))
R. W. Johnson Pharmaceutical Research Institute
Curated by ChEMBL
LigandPNGBDBM50029262(Pentanoic acid {5-[4-(2-isopropoxy-phenyl)-piperaz...)
Affinity DataKi:  50nM. Assay description: Binding affinity was determined against Dopamine receptor D2 using [3H]spiperone
In DepthDetails ArticlePubMed