BDBM50029359 4-Amino-2-aminomethyl-3-methyl-butyric acid::CHEMBL344906
SMILES CC(CN)C(CN)C(O)=O
InChI Key InChIKey=YPEXLZVHIICQKL-UHFFFAOYSA-N
Data  1 KI
  Tab Delimited (TSV)   2D SDfile   Computed 3D by Vconf -m prep SDfile
Find this compound or compounds like it in BindingDB:
Activity Spreadsheet -- Enzyme Inhibition Constant Data from BindingDB
Found 1 hit for monomerid = 50029359
TargetOrnithine decarboxylase(Rattus norvegicus)
Universidad De Buenos Aires
Curated by ChEMBL
LigandPNGBDBM50029359(4-Amino-2-aminomethyl-3-methyl-butyric acid | CHEM...)
Affinity DataKi:  7.20E+5nM. Assay description: Inhibition of liver Ornithine decarboxylase in thioacetamide-treated rat
In DepthDetails ArticlePubMed