BDBM50029360 2,2-dimethyl-1,4-butanediammonium
SMILES CC(C)(C[NH3+])CC[NH3+]
InChI Key InChIKey=JJOABXBOTQOWCE-UHFFFAOYSA-P
Data  1 KI
  Tab Delimited (TSV)   2D SDfile   Computed 3D by Vconf -m prep SDfile
Find this compound or compounds like it in BindingDB:
Activity Spreadsheet -- Enzyme Inhibition Constant Data from BindingDB
Found 1 hit for monomerid = 50029360
TargetOrnithine decarboxylase(Rattus norvegicus)
Universidad De Buenos Aires
Curated by ChEMBL
LigandPNGBDBM50029360(2,2-dimethyl-1,4-butanediammonium)
Affinity DataKi: >1.00E+7nM. Assay description: Inhibition of liver Ornithine decarboxylase in thioacetamide-treated rat
In DepthDetails ArticlePubMed