BDBM50029730 CHEMBL1957193
SMILES O=C1c2ccccc2-c2c1c1c(CCCC1=O)n2CCCc1ccccc1
InChI Key InChIKey=JCCWMVJVFGZDBV-UHFFFAOYSA-N
Data  1 IC50
  Tab Delimited (TSV)   2D SDfile   Computed 3D by Vconf -m prep SDfile
Find this compound or compounds like it in BindingDB:
Activity Spreadsheet -- Enzyme Inhibition Constant Data from BindingDB
Found 1 hit for monomerid = 50029730
TargetBroad substrate specificity ATP-binding cassette transporter ABCG2(Homo sapiens (Human))
Bmssi Umr 5086 Cnrs/Universit£
Curated by ChEMBL
LigandPNGBDBM50029730(CHEMBL1957193)
Affinity DataIC50:  790nM. Assay description: Inhibition of ABCG2 (unknown origin) expressed in HEK293 cells assessed as reduction in mitoxantrone efflux after 30 mins by FACS method
In DepthDetails ArticlePubMed