BDBM50029744 CHEMBL3353417
SMILES COc1cccc(CCn2c3CCCC(=O)c3c3C(=O)c4ccccc4-c23)c1
InChI Key InChIKey=LOIVDCFVCNLNCO-UHFFFAOYSA-N
Data  1 IC50
  Tab Delimited (TSV)   2D SDfile   Computed 3D by Vconf -m prep SDfile
Find this compound or compounds like it in BindingDB:
Activity Spreadsheet -- Enzyme Inhibition Constant Data from BindingDB
Found 1 hit for monomerid = 50029744
TargetBroad substrate specificity ATP-binding cassette transporter ABCG2(Homo sapiens (Human))
Bmssi Umr 5086 Cnrs/Universit£
Curated by ChEMBL
LigandPNGBDBM50029744(CHEMBL3353417)
Affinity DataIC50:  310nM. Assay description: Inhibition of ABCG2 (unknown origin) expressed in HEK293 cells assessed as reduction in mitoxantrone efflux after 30 mins by FACS method
In DepthDetails ArticlePubMed