BDBM50030133 (S)-2-Acetylamino-3-(1H-indol-3-yl)-propionic acid 3,5-dimethyl-benzyl ester::2-Acetylamino-3-(1H-indol-3-yl)-propionic acid 3,5-dimethyl-benzyl ester::CHEMBL23129::L-708568
SMILES CC(=O)N[C@@H](Cc1c[nH]c2ccccc12)C(=O)OCc1cc(C)cc(C)c1
InChI Key InChIKey=YIHWPQQGVKFHTC-NRFANRHFSA-N
Data  6 IC50
  Tab Delimited (TSV)   2D SDfile   Computed 3D by Vconf -m prep SDfile
Find this compound or compounds like it in BindingDB:
Activity Spreadsheet -- Enzyme Inhibition Constant Data from BindingDB
Found 6 hits for monomerid = 50030133
TargetSubstance-P receptor(Homo sapiens (Human))
Merck Sharp And Dohme Research Laboratories
Curated by ChEMBL
LigandPNGBDBM50030133((S)-2-Acetylamino-3-(1H-indol-3-yl)-propionic acid...)
Affinity DataIC50:  67nM. Assay description: Binding affinity towards cloned neurokinin 1 receptor, based on the displacement of [125I]-labeled substance P
In DepthDetails ArticlePubMed
TargetNeuromedin-K receptor(Homo sapiens (Human))
Merck Sharp And Dohme Research Laboratories
Curated by ChEMBL
LigandPNGBDBM50030133((S)-2-Acetylamino-3-(1H-indol-3-yl)-propionic acid...)
Affinity DataIC50: >5.00E+3nM. Assay description: Affinity to NK3 receptors assayed by displacement of [125I]-Bolton-Hunter labeled eledoisin radioligand
In DepthDetails ArticlePubMed
TargetSubstance-P receptor(Homo sapiens (Human))
Merck Sharp And Dohme Research Laboratories
Curated by ChEMBL
LigandPNGBDBM50030133((S)-2-Acetylamino-3-(1H-indol-3-yl)-propionic acid...)
Affinity DataIC50:  52.5nM. Assay description: Binding affinity was measured against the Tachykinin receptor 1 in CHO-expressed hNK1 using [125I]SP.
In DepthDetails ArticlePubMed
TargetSubstance-P receptor(Homo sapiens (Human))
Merck Sharp And Dohme Research Laboratories
Curated by ChEMBL
LigandPNGBDBM50030133((S)-2-Acetylamino-3-(1H-indol-3-yl)-propionic acid...)
Affinity DataIC50:  67nM. Assay description: Binding affinity against human Tachykinin receptor 1 expressed in CHO cells was measured by its ability to displace [125I]- Tyr-8 substance P.
In DepthDetails ArticlePubMed
TargetSubstance-P receptor(Homo sapiens (Human))
Merck Sharp And Dohme Research Laboratories
Curated by ChEMBL
LigandPNGBDBM50030133((S)-2-Acetylamino-3-(1H-indol-3-yl)-propionic acid...)
Affinity DataIC50:  67nM. Assay description: Tested against cloned human NK1 receptor by displacement of 125 I -labeled substance P expressed in CHO cells
In DepthDetails ArticlePubMed
TargetSubstance-K receptor(Homo sapiens (Human))
Merck Sharp And Dohme Research Laboratories
Curated by ChEMBL
LigandPNGBDBM50030133((S)-2-Acetylamino-3-(1H-indol-3-yl)-propionic acid...)
Affinity DataIC50: >5.00E+3nM. Assay description: Binding affinity to the NK2 receptor assayed by displacement of [125I]-Neurokinin A
In DepthDetails ArticlePubMed