BDBM50030730 CHEMBL341369::Pentanoic acid {4-bromo-3-[4-(3-fluoro-2'-(N-t-butyloxycarbonyl)-Sulfanamido-biphenyl-4-ylmethyl)-5-oxo-3-propyl-4,5-dihydro-[1,2,4]triazol-1-yl]-phenyl}-amide
SMILES CCCCC(=O)Nc1ccc(Br)c(c1)-n1nc(CCC)n(Cc2ccc(cc2F)-c2ccccc2S(=O)(=O)NC(=O)OC(C)(C)C)c1=O
InChI Key InChIKey=DIKNHFNGFPAMID-UHFFFAOYSA-N
Data  7 IC50
  Tab Delimited (TSV)   2D SDfile   Computed 3D by Vconf -m prep SDfile
Find this compound or compounds like it in BindingDB:
Activity Spreadsheet -- Enzyme Inhibition Constant Data from BindingDB
Found 7 hits for monomerid = 50030730
TargetType-1 angiotensin II receptor(RABBIT)
Merck Research Laboratories
Curated by ChEMBL
LigandPNGBDBM50030730(CHEMBL341369 | Pentanoic acid {4-bromo-3-[4-(3-flu...)
Affinity DataIC50:  0.210nM. Assay description: In vitro inhibitory activity against Angiotensin II receptor, type 1 in rabbit aorta membrane preparations.
In DepthDetails ArticlePubMed
TargetType-2 angiotensin II receptor(RAT)
Merck Research Laboratories
Curated by ChEMBL
LigandPNGBDBM50030730(CHEMBL341369 | Pentanoic acid {4-bromo-3-[4-(3-flu...)
Affinity DataIC50:  0.160nM. Assay description: In vitro inhibitory activity against Angiotensin II receptor, type 2 in rat midbrain membrane preparations.
In DepthDetails ArticlePubMed
TargetType-1 angiotensin II receptor(Homo sapiens (Human))
Merck Research Laboratories
Curated by ChEMBL
LigandPNGBDBM50030730(CHEMBL341369 | Pentanoic acid {4-bromo-3-[4-(3-flu...)
Affinity DataIC50:  0.430nM. Assay description: In vitro inhibitory activity against angiotensin II receptor type 1, in human adrenal membrane preparations.
In DepthDetails ArticlePubMed
TargetType-1 angiotensin II receptor(RABBIT)
Merck Research Laboratories
Curated by ChEMBL
LigandPNGBDBM50030730(CHEMBL341369 | Pentanoic acid {4-bromo-3-[4-(3-flu...)
Affinity DataIC50:  0.210nM. Assay description: Antagonist activity at Oryctolagus cuniculus (rabbit) aortic AT1 receptor
In DepthDetails Article
TargetType-2 angiotensin II receptor(Homo sapiens (Human))
Merck Research Laboratories
Curated by ChEMBL
LigandPNGBDBM50030730(CHEMBL341369 | Pentanoic acid {4-bromo-3-[4-(3-flu...)
Affinity DataIC50:  2.20nM. Assay description: In vitro inhibitory activity against Angiotensin II receptor type 2 in human adrenal membrane preparations.
In DepthDetails ArticlePubMed
TargetType-1 angiotensin II receptor(RABBIT)
Merck Research Laboratories
Curated by ChEMBL
LigandPNGBDBM50030730(CHEMBL341369 | Pentanoic acid {4-bromo-3-[4-(3-flu...)
Affinity DataIC50:  0.210nM. Assay description: Antagonist activity at Oryctolagus cuniculus (rabbit) aortic AT1 receptor
In DepthDetails Article
TargetType-2 angiotensin II receptor(RAT)
Merck Research Laboratories
Curated by ChEMBL
LigandPNGBDBM50030730(CHEMBL341369 | Pentanoic acid {4-bromo-3-[4-(3-flu...)
Affinity DataIC50:  0.170nM. Assay description: In vitro inhibitory activity against angiotensin II type 2 receptor in rat adrenal membrane preparations.
In DepthDetails ArticlePubMed