BDBM50031082 3-Bromo-2-chloro-4-(4-fluoro-phenyl)-5-(4-methanesulfonyl-phenyl)-1H-pyrrole::CHEMBL339221
SMILES CS(=O)(=O)c1ccc(cc1)-c1[nH]c(Cl)c(Br)c1-c1ccc(F)cc1
InChI Key InChIKey=MLPPOAYZOPVCEA-UHFFFAOYSA-N
Data  2 IC50
  Tab Delimited (TSV)   2D SDfile   Computed 3D by Vconf -m prep SDfile
Find this compound or compounds like it in BindingDB:
Activity Spreadsheet -- Enzyme Inhibition Constant Data from BindingDB
Found 2 hits for monomerid = 50031082
TargetProstaglandin G/H synthase 1(Ovis aries (Sheep))
Dupont Pharmaceuticals
Curated by ChEMBL
LigandPNGBDBM50031082(3-Bromo-2-chloro-4-(4-fluoro-phenyl)-5-(4-methanes...)
Affinity DataIC50:  4.40E+4nM. Assay description: Tested for inhibitory activity against Prostaglandin G/H synthase 1 from ovine
In DepthDetails ArticlePubMed
TargetProstaglandin G/H synthase 2(Homo sapiens (Human))
Dupont Pharmaceuticals
Curated by ChEMBL
LigandPNGBDBM50031082(3-Bromo-2-chloro-4-(4-fluoro-phenyl)-5-(4-methanes...)
Affinity DataIC50:  8.80E+4nM. Assay description: Tested for inhibitory activity against Prostaglandin G/H synthase 2 from human
In DepthDetails ArticlePubMed