BDBM50031700 CHEMBL3360287
SMILES CC(C)[C@H](NC(=O)[C@H](C)NC(=O)[C@@H](NC(=O)c1ccccc1)C(C)(C)C)C(=O)C(=O)NCc1cn[nH]c1
InChI Key InChIKey=FQPVAGMSUSGTOM-NBHGPNQESA-N
Data  2 IC50
  Tab Delimited (TSV)   2D SDfile   Computed 3D by Vconf -m prep SDfile
Find this compound or compounds like it in BindingDB:
Activity Spreadsheet -- Enzyme Inhibition Constant Data from BindingDB
Found 2 hits for monomerid = 50031700
TargetCathepsin B(Homo sapiens (Human))
Domainex
Curated by ChEMBL
LigandPNGBDBM50031700(CHEMBL3360287)
Affinity DataIC50:  367nM. Assay description: Inhibition of human liver cathepsin B using ABz-Gly-Ile-Val-Arg-Ala-Lys-DNP-OH as substrate after 10 mins by fluorescence assay
In DepthDetails ArticlePubMed
TargetPeptidase 1(Dermatophagoides pteronyssinus (European house dus...)
Domainex
Curated by ChEMBL
LigandPNGBDBM50031700(CHEMBL3360287)
Affinity DataIC50:  11nM. Assay description: Inhibition of house dust mite Derp-1 after 20 mins
In DepthDetails ArticlePubMed