BDBM50032367 CHEMBL317962::isopentyloxy 2-[2-(4-{4-ethyl-5-[3-[2-pyridyl(4-pyridyl)carboxamidopropanoyl]-2-propyl-1H-1-imidazolylmethyl}-3-fluorophenyl)phenylsulfonyl]caboxamido
SMILES CCCc1nc(CC)c(C(=O)CCN(C(=O)c2cccnc2)c2ccccn2)n1Cc1ccc(cc1F)-c1ccccc1S(=O)(=O)NC(=O)OCCC(C)C
InChI Key InChIKey=JRPXJLWXCAOCED-UHFFFAOYSA-N
Data  1 IC50
  Tab Delimited (TSV)   2D SDfile   Computed 3D by Vconf -m prep SDfile
Find this compound or compounds like it in BindingDB:
Activity Spreadsheet -- Enzyme Inhibition Constant Data from BindingDB
Found 1 hit for monomerid = 50032367
TargetType-2 angiotensin II receptor(RAT)
Dupont Pharmaceuticals
Curated by ChEMBL
LigandPNGBDBM50032367(CHEMBL317962 | isopentyloxy 2-[2-(4-{4-ethyl-5-[3-...)
Affinity DataIC50:  0.160nM. Assay description: Inhibition of [125I]-[Sar1,Ile8]Ang II binding at rat angiotensin II (type 2) receptor.
In DepthDetails ArticlePubMed