BDBM50033613 1H-Indole-2-carboxylic acid {4-(2-acetylamino-3-hydroxy-butyrylamino)-1-[1-(benzyl-methyl-carbamoyl)-2-phenyl-ethylcarbamoyl]-butyl}-amide::CHEMBL311688
SMILES C[C@@H](O)C(NC(C)=O)C(=O)NCCCC(NC(=O)c1cc2ccccc2[nH]1)C(=O)N[C@H](Cc1ccccc1)C(=O)N(C)Cc1ccccc1
InChI Key InChIKey=ZMONKGJOFYGVRE-OHDFALRFSA-N
Data  1 IC50
  Tab Delimited (TSV)   2D SDfile   Computed 3D by Vconf -m prep SDfile
Find this compound or compounds like it in BindingDB:
Activity Spreadsheet -- Enzyme Inhibition Constant Data from BindingDB
Found 1 hit for monomerid = 50033613
TargetSubstance-P receptor(GUINEA PIG)
Fujisawa Pharmaceutical
Curated by ChEMBL
LigandPNGBDBM50033613(1H-Indole-2-carboxylic acid {4-(2-acetylamino-3-hy...)
Affinity DataIC50:  125nM. Assay description: Tested for inhibition against [3H]-SP (substance P) (1 nM) binding to NK1 receptor in guinea pig lung membranes
In DepthDetails ArticlePubMed