BDBM50033902 (R)-{4-[(2-Methyl-4-oxo-3,4-dihydro-quinazolin-6-ylmethyl)-prop-2-ynyl-amino]-benzoylamino}-phenyl-acetic acid::CHEMBL266956
SMILES Cc1nc2ccc(CN(CC#C)c3ccc(cc3)C(=O)N[C@@H](C(O)=O)c3ccccc3)cc2c(=O)[nH]1
InChI Key InChIKey=AIVKSVVGOBYYHG-RUZDIDTESA-N
Data  1 IC50
  Tab Delimited (TSV)   2D SDfile   Computed 3D by Vconf -m prep SDfile
Find this compound or compounds like it in BindingDB:
Activity Spreadsheet -- Enzyme Inhibition Constant Data from BindingDB
Found 1 hit for monomerid = 50033902
TargetThymidylate synthase(Mus musculus)
Zeneca Pharmaceuticals
Curated by ChEMBL
LigandPNGBDBM50033902((R)-{4-[(2-Methyl-4-oxo-3,4-dihydro-quinazolin-6-y...)
Affinity DataIC50:  34nM. Assay description: Inhibition of thymidylate synthase purified from mouse L1210 leukemia cells that overproduce thymidylate synthase (TS)
In DepthDetails ArticlePubMed