BDBM50035298 CHEMBL3343363
SMILES COc1cc2c(Oc3ccc(NC(=O)c4nnn(c4C)-c4ccccc4C)cc3F)ccnc2cc1OCCCN1CCCC1
InChI Key InChIKey=RJMBEUADUJYIEH-UHFFFAOYSA-N
Data  1 IC50
  Tab Delimited (TSV)   2D SDfile   Computed 3D by Vconf -m prep SDfile
Find this compound or compounds like it in BindingDB:
Activity Spreadsheet -- Enzyme Inhibition Constant Data from BindingDB
Found 1 hit for monomerid = 50035298
TargetHepatocyte growth factor receptor(Homo sapiens (Human))
Key Laboratory Of Structure-Based Drug Design And Discovery (Shenyang Pharmaceutical University)
Curated by ChEMBL
LigandPNGBDBM50035298(CHEMBL3343363)
Affinity DataIC50:  8.5nM. Assay description: Inhibition of c-Met (unknown origin) using poly (Glu, Tyr) 4:1 substrate incubated for 30 mins by HTRF assay
In DepthDetails ArticlePubMed