BDBM50036040 ((S)-2-Methyl-1-{(S)-2-[(S)-2-methyl-1-(oxazole-2-carbonyl)-propylcarbamoyl]-pyrrolidine-1-carbonyl}-propyl)-carbamic acid benzyl ester::CHEMBL352305::benzyl (S)-1-((S)-2-(((S)-3-methyl-1-(oxazol-2-yl)-1-oxobutan-2-yl)carbamoyl)pyrrolidin-1-yl)-3-methyl-1-oxobutan-2-ylcarbamate
SMILES CC(C)[C@H](NC(=O)OCc1ccccc1)C(=O)N1CCC[C@H]1C(=O)N[C@@H](C(C)C)C(=O)c1ncco1
InChI Key InChIKey=ALJSOFULNYQGDQ-ACRUOGEOSA-N
Data  3 KI
  Tab Delimited (TSV)   2D SDfile   Computed 3D by Vconf -m prep SDfile
Find this compound or compounds like it in BindingDB:
Activity Spreadsheet -- Enzyme Inhibition Constant Data from BindingDB
Found 1 hit for monomerid = 50036040
TargetNeutrophil elastase(Homo sapiens (Human))
Johnson & Johnson Pharmaceutical Research & Development
Curated by ChEMBL
LigandPNGBDBM50036040(((S)-2-Methyl-1-{(S)-2-[(S)-2-methyl-1-(oxazole-2-...)
Affinity DataKi:  28nM. Assay description: Inhibition of human neutrophil elastase
In DepthDetails ArticlePubMed