BDBM50036639 CHEMBL3354777
SMILES CCOC(=O)[C@](C)(Cc1ccccc1)c1c(Cl)cnc2c(cnn12)-c1ccc(cc1)C(F)(F)F
InChI Key InChIKey=WLBFJSWAVVNSGS-XMMPIXPASA-N
Data  2 EC50
  Tab Delimited (TSV)   2D SDfile   Computed 3D by Vconf -m prep SDfile
Find this compound or compounds like it in BindingDB:
Activity Spreadsheet -- Enzyme Inhibition Constant Data from BindingDB
Found 2 hits for monomerid = 50036639
TargetGlucose-dependent insulinotropic receptor(Mus musculus)
Genomics Institute Of The Novartis Research Foundation
Curated by ChEMBL
LigandPNGBDBM50036639(CHEMBL3354777)
Affinity DataEC50:  8nM. Assay description: Agonist activity at mouse GPR119 overexpressed in CHO cells assessed as increase in cellular cAMP production by HTRF method
In DepthDetails ArticlePubMed
TargetGlucose-dependent insulinotropic receptor(Homo sapiens (Human))
Genomics Institute Of The Novartis Research Foundation
Curated by ChEMBL
LigandPNGBDBM50036639(CHEMBL3354777)
Affinity DataEC50:  3nM. Assay description: Agonist activity at human GPR119 overexpressed in CHO cells assessed as increase in cellular cAMP production by HTRF method
In DepthDetails ArticlePubMed