BDBM50036652 CHEMBL3354784
SMILES CCOC(=O)[C@@]1(Cc2ccccc2)CCc2cnc3c(cnn3c12)-c1ccc(Cl)cc1
InChI Key InChIKey=YTIMOVZKXDRWIW-RUZDIDTESA-N
Data  2 EC50
  Tab Delimited (TSV)   2D SDfile   Computed 3D by Vconf -m prep SDfile
Find this compound or compounds like it in BindingDB:
Activity Spreadsheet -- Enzyme Inhibition Constant Data from BindingDB
Found 2 hits for monomerid = 50036652
TargetGlucose-dependent insulinotropic receptor(Mus musculus)
Genomics Institute Of The Novartis Research Foundation
Curated by ChEMBL
LigandPNGBDBM50036652(CHEMBL3354784)
Affinity DataEC50:  11nM. Assay description: Agonist activity at mouse GPR119 overexpressed in CHO cells assessed as increase in cellular cAMP production by HTRF method
In DepthDetails ArticlePubMed
TargetGlucose-dependent insulinotropic receptor(Homo sapiens (Human))
Genomics Institute Of The Novartis Research Foundation
Curated by ChEMBL
LigandPNGBDBM50036652(CHEMBL3354784)
Affinity DataEC50:  3nM. Assay description: Agonist activity at human GPR119 overexpressed in CHO cells assessed as increase in cellular cAMP production by HTRF method
In DepthDetails ArticlePubMed