BDBM50036661 CHEMBL3354792
SMILES CCOC(=O)C1(Cc2ccccc2)N(C)Cc2cnc3c(cnn3c12)-c1ccc(cc1)C(F)(F)F
InChI Key InChIKey=XCEHXJCCOGXTBG-UHFFFAOYSA-N
Data  1 EC50
  Tab Delimited (TSV)   2D SDfile   Computed 3D by Vconf -m prep SDfile
Find this compound or compounds like it in BindingDB:
Activity Spreadsheet -- Enzyme Inhibition Constant Data from BindingDB
Found 1 hit for monomerid = 50036661
TargetGlucose-dependent insulinotropic receptor(Homo sapiens (Human))
Genomics Institute Of The Novartis Research Foundation
Curated by ChEMBL
LigandPNGBDBM50036661(CHEMBL3354792)
Affinity DataEC50:  214nM. Assay description: Agonist activity at human GPR119 overexpressed in CHO cells assessed as increase in cellular cAMP production by HTRF method
In DepthDetails ArticlePubMed