BDBM50036795 CHEMBL3354834
SMILES CCCc1cc(=O)nc(Nc2ccc(Cl)c(c2O)S(=O)(=O)C(C)C)[nH]1
InChI Key InChIKey=PFAWFZSIASBHCQ-UHFFFAOYSA-N
Data  1 IC50
  Tab Delimited (TSV)   2D SDfile   Computed 3D by Vconf -m prep SDfile
Find this compound or compounds like it in BindingDB:
Activity Spreadsheet -- Enzyme Inhibition Constant Data from BindingDB
Found 1 hit for monomerid = 50036795
TargetC-X-C chemokine receptor type 2(Homo sapiens (Human))
Glaxosmithkline
Curated by ChEMBL
LigandPNGBDBM50036795(CHEMBL3354834)
Affinity DataIC50:  200nM. Assay description: Antagonist activity at CXCR2 (unknown origin) by beta-arrestin assay
In DepthDetails ArticlePubMed