BDBM50036809 CHEMBL3355243
SMILES CC(C)S(=O)(=O)c1c(Cl)ccc(Nc2nc(=O)cc([nH]2)C(C)(C)F)c1O
InChI Key InChIKey=SEWDJXPIGZYPQH-UHFFFAOYSA-N
Data  1 IC50
  Tab Delimited (TSV)   2D SDfile   Computed 3D by Vconf -m prep SDfile
Find this compound or compounds like it in BindingDB:
Activity Spreadsheet -- Enzyme Inhibition Constant Data from BindingDB
Found 1 hit for monomerid = 50036809
TargetC-X-C chemokine receptor type 2(Homo sapiens (Human))
Glaxosmithkline
Curated by ChEMBL
LigandPNGBDBM50036809(CHEMBL3355243)
Affinity DataIC50:  126nM. Assay description: Antagonist activity at CXCR2 (unknown origin) by beta-arrestin assay
In DepthDetails ArticlePubMed