BDBM50036876 CHEMBL3355247
SMILES CC(C)S(=O)(=O)c1c(Cl)ccc(Nc2nc(=O)c(F)c([nH]2)C(C)(C)C)c1O
InChI Key InChIKey=IZHZHPKZBOCYTK-UHFFFAOYSA-N
Data  1 IC50
  Tab Delimited (TSV)   2D SDfile   Computed 3D by Vconf -m prep SDfile
Find this compound or compounds like it in BindingDB:
Activity Spreadsheet -- Enzyme Inhibition Constant Data from BindingDB
Found 1 hit for monomerid = 50036876
TargetC-X-C chemokine receptor type 2(Homo sapiens (Human))
Glaxosmithkline
Curated by ChEMBL
LigandPNGBDBM50036876(CHEMBL3355247)
Affinity DataIC50:  25nM. Assay description: Antagonist activity at CXCR2 (unknown origin) by beta-arrestin assay
In DepthDetails ArticlePubMed