BDBM50037186 2-[6-(Benzyl-ethyl-amino)-hexyl]-5-nitro-isoindole-1,3-dione::CHEMBL110723
SMILES CCN(CCCCCCN1C(=O)c2ccc(cc2C1=O)[N+]([O-])=O)Cc1ccccc1
InChI Key InChIKey=UURLKHJUYCDSMJ-UHFFFAOYSA-N
Data  1 IC50
  Tab Delimited (TSV)   2D SDfile   Computed 3D by Vconf -m prep SDfile
Find this compound or compounds like it in BindingDB:
Activity Spreadsheet -- Enzyme Inhibition Constant Data from BindingDB
Found 1 hit for monomerid = 50037186
TargetAcetylcholinesterase(Rattus norvegicus (rat))
Takeda Chemical Industries
Curated by ChEMBL
LigandPNGBDBM50037186(2-[6-(Benzyl-ethyl-amino)-hexyl]-5-nitro-isoindole...)
Affinity DataIC50:  607nM. Assay description: Inhibition concentration against rat acetylcholinesterase
In DepthDetails ArticlePubMed