BDBM50037500 CHEMBL259478
SMILES [H][C@]1(C[C@H](CN1C(=O)[C@@H](NC(=O)OC(C)(C)C)C(C)(C)C)Oc1cc(nc2cc(OC)ccc12)-c1ccccc1)C(=O)Nc1ccccc1C(=O)NS(=O)(=O)c1ccccc1
InChI Key InChIKey=JMGFJSHONQYBNU-CIBRAPPLSA-N
Data  1 KI
  Tab Delimited (TSV)   2D SDfile   Computed 3D by Vconf -m prep SDfile
Find this compound or compounds like it in BindingDB:
Activity Spreadsheet -- Enzyme Inhibition Constant Data from BindingDB
Found 1 hit for monomerid = 50037500
TargetGenome polyprotein(Hepatitis C virus)
TBA
Curated by ChEMBL
LigandPNGBDBM50037500(CHEMBL259478)
Affinity DataKi:  830nM. Assay description: Inhibition of HCV genotype 1a NS3/4A protease using Ac-DED(Edans)EEAbu-psi[COO]ASK(Dabcyl)-NH2 as substrate by FRET assay
In DepthDetails ArticlePubMed