BDBM50037973 (R)-N-((S)-1-Carbamimidoyl-piperidin-3-ylmethyl)-2-(naphthalene-2-sulfonylamino)-3-phenyl-propionamide; hydrochloride::CHEMBL544830
SMILES NC(=N)N1CCC[C@@H](CNC(=O)[C@@H](Cc2ccccc2)NS(=O)(=O)c2ccc3ccccc3c2)C1
InChI Key InChIKey=WWJJOLLOSVQTGQ-GBXCKJPGSA-N
Data  4 KI
PDB links: 1 PDB ID matches this monomer.
  Tab Delimited (TSV)   2D SDfile   Computed 3D by Vconf -m prep SDfile
Find this compound or compounds like it in BindingDB:
Activity Spreadsheet -- Enzyme Inhibition Constant Data from BindingDB
Found 4 hits for monomerid = 50037973
TargetProthrombin(Homo sapiens (Human))
F. Hoffmann-La Roche
Curated by ChEMBL
LigandPNGBDBM50037973((R)-N-((S)-1-Carbamimidoyl-piperidin-3-ylmethyl)-2...)
Affinity DataKi:  32nM. Assay description: In vitro binding affinity by measuring the inhibition of human thrombin
TargetProthrombin(Homo sapiens (Human))
F. Hoffmann-La Roche
Curated by ChEMBL
LigandPNGBDBM50037973((R)-N-((S)-1-Carbamimidoyl-piperidin-3-ylmethyl)-2...)
Affinity DataKi:  47nM. Assay description: In vitro binding affinity by measuring the inhibition of human thrombin
TargetSerine protease 1(Bos taurus (bovine))
F. Hoffmann-La Roche
Curated by ChEMBL
LigandPNGBDBM50037973((R)-N-((S)-1-Carbamimidoyl-piperidin-3-ylmethyl)-2...)
Affinity DataKi:  2.60E+4nM. Assay description: In vitro binding affinity by measuring the inhibition of bovine trypsin
In DepthDetails ArticlePubMed
TargetSerine protease 1(Bos taurus (bovine))
F. Hoffmann-La Roche
Curated by ChEMBL
LigandPNGBDBM50037973((R)-N-((S)-1-Carbamimidoyl-piperidin-3-ylmethyl)-2...)
Affinity DataKi:  4.20E+4nM. Assay description: In vitro binding affinity by measuring the inhibition of bovine trypsin
In DepthDetails ArticlePubMed