BDBM50037997 (S)-4-Azocan-1-yl-N-(1-carbamimidoyl-piperidin-3-ylmethyl)-3-(naphthalene-2-sulfonylamino)-4-oxo-butyramide; hydrochloride::CHEMBL539557
SMILES NC(=N)N1CCCC(CNC(=O)C[C@H](NS(=O)(=O)c2ccc3ccccc3c2)C(=O)N2CCCCCCC2)C1
InChI Key InChIKey=YYWMFCVWCHCARK-QBGQUKIHSA-N
Data  2 KI
  Tab Delimited (TSV)   2D SDfile   Computed 3D by Vconf -m prep SDfile
Find this compound or compounds like it in BindingDB:
Activity Spreadsheet -- Enzyme Inhibition Constant Data from BindingDB
Found 2 hits for monomerid = 50037997
TargetProthrombin(Homo sapiens (Human))
F. Hoffmann-La Roche
Curated by ChEMBL
LigandPNGBDBM50037997((S)-4-Azocan-1-yl-N-(1-carbamimidoyl-piperidin-3-y...)
Affinity DataKi:  4.80nM. Assay description: In vitro binding affinity by measuring the inhibition of human thrombin
In DepthDetails ArticlePubMed
TargetSerine protease 1(Bos taurus (bovine))
F. Hoffmann-La Roche
Curated by ChEMBL
LigandPNGBDBM50037997((S)-4-Azocan-1-yl-N-(1-carbamimidoyl-piperidin-3-y...)
Affinity DataKi:  2.80E+4nM. Assay description: In vitro binding affinity by measuring the inhibition of bovine trypsin
In DepthDetails ArticlePubMed