BDBM50038207 CHEMBL3094025
SMILES ClCc1cc(=O)oc2cc(OCc3cccc(Cl)c3)ccc12
InChI Key InChIKey=WGEZPSXGFOLSFP-UHFFFAOYSA-N
Data  2 IC50
  Tab Delimited (TSV)   2D SDfile   Computed 3D by Vconf -m prep SDfile
Find this compound or compounds like it in BindingDB:
Activity Spreadsheet -- Enzyme Inhibition Constant Data from BindingDB
Found 2 hits for monomerid = 50038207
TargetAmine oxidase [flavin-containing] B(Rattus norvegicus (rat))
Universit£
Curated by ChEMBL
LigandPNGBDBM50038207(CHEMBL3094025)
Affinity DataIC50:  44nM. Assay description: Inhibition of Sprague-Dawley rat MAO-B using Kynuramine as substrate assessed as formation of 4-hydroxyquinoline preincubated for 5 mins prior to sub...
In DepthDetails ArticlePubMed
TargetAmine oxidase [flavin-containing] B(Rattus norvegicus (rat))
Universit£
Curated by ChEMBL
LigandPNGBDBM50038207(CHEMBL3094025)
Affinity DataIC50:  44nM. Assay description: Inhibition of Sprague-Dawley rat MAO-B in brain mitochondrial homogenate assessed as 4-hydroxyquinoline by spectrophotometric method
In DepthDetails ArticlePubMed